Reaction Details
TargetCannabinoid receptor 2
LigandBDBM50172174
Substrate/Competitorn/a
Meas. Tech.ChEMBL_320783 (CHEMBL884738)
Ki 1.3±n/a nM
Citation Shankar, BBLavey, BJZhou, GSpitler, JATong, LRizvi, RYang, DYWolin, RKozlowski, JAShih, NYWu, JHipkin, RWGonsiorek, WLunn, CA Triaryl bis-sulfones as cannabinoid-2 receptor ligands: SAR studies. Bioorg Med Chem Lett15:4417-20 (2005) 
 
Cannabinoid receptor 2
Name:Cannabinoid receptor 2
Type:G Protein-Coupled Receptor (GPCR)
Mol. Mass.:39690.94
Organism:Homo sapiens (Human)
Description:P34972
Residue:360
BDBM50172174
NameBDBM50172174
Synonyms:CHEMBL197777 | N-{4-[4-Methoxy-2-(4-methoxy-benzenesulfonyl)-benzenesulfonyl]-benzyl}-methanesulfonamide
TypeSmall organic molecule
Emp. Form.C22H23NO8S3
Mol. Mass.525.615
SMILESCOc1ccc(cc1)S(=O)(=O)c1cc(OC)ccc1S(=O)(=O)c1ccc(CNS(C)(=O)=O)cc1