Reaction Details
TargetCannabinoid receptor 2
LigandBDBM50172183
Substrate/Competitorn/a
Meas. Tech.ChEMBL_320783 (CHEMBL884738)
Ki 1.8±n/a nM
Citation Shankar, BBLavey, BJZhou, GSpitler, JATong, LRizvi, RYang, DYWolin, RKozlowski, JAShih, NYWu, JHipkin, RWGonsiorek, WLunn, CA Triaryl bis-sulfones as cannabinoid-2 receptor ligands: SAR studies. Bioorg Med Chem Lett15:4417-20 (2005) 
 
Cannabinoid receptor 2
Name:Cannabinoid receptor 2
Type:G Protein-Coupled Receptor (GPCR)
Mol. Mass.:39690.94
Organism:Homo sapiens (Human)
Description:P34972
Residue:360
BDBM50172183
NameBDBM50172183
Synonyms:CHEMBL197904 | N-((S)-1-{4-[2-(2,6-Difluoro-benzenesulfonyl)-4-trifluoromethyl-benzyl]-phenyl}-ethyl)-methanesulfonamide
TypeSmall organic molecule
Emp. Form.C23H20F5NO4S2
Mol. Mass.533.531
SMILESC[C@H](NS(C)(=O)=O)c1ccc(Cc2ccc(cc2S(=O)(=O)c2c(F)cccc2F)C(F)(F)F)cc1