Reaction Details
TargetProstaglandin G/H synthase 1
LigandBDBM50172473
Substrate/Competitorn/a
Meas. Tech.ChEMBL_321330 (CHEMBL880614)
IC50 44000±n/a nM
Citation Peretto, IRadaelli, SParini, CZandi, MRaveglia, LFDondio, GFontanella, LMisiano, PBigogno, CRizzi, ARiccardi, BBiscaioli, MMarchetti, SPuccini, PCatinella, SRondelli, ICenacchi, VBolzoni, PTCaruso, PVilletti, GFacchinetti, FDel Giudice, EMoretto, NImbimbo, BP Synthesis and biological activity of flurbiprofen analogues as selective inhibitors of beta-amyloid(1)(-)(42) secretion. J Med Chem48:5705-20 (2005) 
 
Prostaglandin G/H synthase 1
Name:Prostaglandin G/H synthase 1
Type:Enzyme Catalytic Domain
Mol. Mass.:69033.56
Organism:RAT
Description:COX-1 0 RAT::Q63921
Residue:602
BDBM50172473
NameBDBM50172473
Synonyms:(-)-(2R)-2-(2-fluorobiphenyl-4-yl)propanoic acid (2R)-2-(2-fluorobiphenyl-4-yl)propanoic acid (R)-FLURBIPROFEN Flurizan | Tarenflurbil
TypeSmall organic molecule
Emp. Form.C15H13FO2
Mol. Mass.244.2609
SMILESC[C@@H](C(O)=O)c1ccc(c(F)c1)-c1ccccc1