Reaction Details
Target1-acyl-sn-glycerol-3-phosphate acyltransferase beta
LigandBDBM50172956
Substrate/Competitorn/a
Meas. Tech.ChEMBL_321473 (CHEMBL880414)
IC50 40±n/a nM
Citation Hong, FHollenback, DSinger, JWKlein, P Diamino-C,N-diarylpyridine positional isomers as inhibitors of lysophosphatidic acid acyltransferase-beta. Bioorg Med Chem Lett15:4703-7 (2005) 
 
1-acyl-sn-glycerol-3-phosphate acyltransferase beta
Name:1-acyl-sn-glycerol-3-phosphate acyltransferase beta
Type:PROTEIN
Mol. Mass.:30924.09
Organism:Homo sapiens (Human)
Description:ChEMBL_321473
Residue:278
BDBM50172956
NameBDBM50172956
Synonyms:4-(5-Chloro-2-methoxy-phenyl)-N-(4-chloro-phenyl)-pyridine-2,6-diamine | CHEMBL193874
TypeSmall organic molecule
Emp. Form.C18H15Cl2N3O
Mol. Mass.360.237
SMILESCOc1ccc(Cl)cc1-c1cc(N)nc(Nc2ccc(Cl)cc2)c1