Reaction Details
Target5-hydroxytryptamine receptor 2C
LigandBDBM50173096
Substrate/Competitorn/a
Meas. Tech.ChEMBL_320889 (CHEMBL872388)
Ki 6.5±n/a nM
Citation Huang, YBae, SARoth, BLLaruelle, M Synthesis of potent and selective serotonin 5-HT1B receptor ligands. Bioorg Med Chem Lett15:4786-9 (2005) 
 
5-hydroxytryptamine receptor 2C
Name:5-hydroxytryptamine receptor 2C
Type:G Protein-Coupled Receptor (GPCR)
Mol. Mass.:51836.79
Organism:Homo sapiens (Human)
Description:P28335
Residue:458
BDBM50173096
NameBDBM50173096
Synonyms:4-Biphenyl-4-yl-piperazine-1-carboxylic acid [4-methoxy-3-(4-methyl-piperazin-1-yl)-phenyl]-amide | CHEMBL197408
TypeSmall organic molecule
Emp. Form.C29H35N5O2
Mol. Mass.485.6205
SMILESCOc1ccc(NC(=O)N2CCN(CC2)c2ccc(cc2)-c2ccccc2)cc1N1CCN(C)CC1