Reaction Details
Target5-hydroxytryptamine receptor 1D
LigandBDBM50173094
Substrate/Competitorn/a
Meas. Tech.ChEMBL_320822 (CHEMBL872357)
Ki 329±n/a nM
Citation Huang, YBae, SARoth, BLLaruelle, M Synthesis of potent and selective serotonin 5-HT1B receptor ligands. Bioorg Med Chem Lett15:4786-9 (2005) 
 
5-hydroxytryptamine receptor 1D
Name:5-hydroxytryptamine receptor 1D
Type:G Protein-Coupled Receptor (GPCR)
Mol. Mass.:41920.63
Organism:Homo sapiens (Human)
Description:Receptor binding assays were performed using human clone stably expressed in CHO cells.
Residue:377
BDBM50173094
NameBDBM50173094
Synonyms:4-(4-Methylsulfanyl-phenyl)-piperazine-1-carboxylic acid [4-methoxy-3-(4-methyl-piperazin-1-yl)-phenyl]-amide | CHEMBL197796
TypeSmall organic molecule
Emp. Form.C24H33N5O2S
Mol. Mass.455.616
SMILESCOc1ccc(NC(=O)N2CCN(CC2)c2ccc(SC)cc2)cc1N1CCN(C)CC1