Reaction Details
TargetDipeptidyl peptidase 2
LigandBDBM50173974
Substrate/Competitorn/a
Meas. Tech.ChEMBL_328424 (CHEMBL863965)
Ki>22385±n/a nM
Citation Haffner, CDMcDougald, DLReister, SMThompson, BDConlee, CFang, JBass, JLenhard, JMCroom, DSecosky-Chang, MBTomaszek, TMcConn, DWells-Knecht, KJohnson, PR 2-Cyano-4-fluoro-1-thiovalylpyrrolidine analogues as potent inhibitors of DPP-IV. Bioorg Med Chem Lett15:5257-61 (2005) 
 
Dipeptidyl peptidase 2
Name:Dipeptidyl peptidase 2
Type:Protein
Mol. Mass.:54339.29
Organism:Homo sapiens (Human)
Description:Q9UHL4
Residue:492
BDBM50173974
NameBDBM50173974
Synonyms:(2S,4S)-1-((R)-2-amino-3-methyl-3-p-tolylmethanesulfonyl-butyryl)-4-fluoro-pyrrolidine-2-carbonitrile | CHEMBL369952
TypeSmall organic molecule
Emp. Form.C18H24FN3O3S
Mol. Mass.381.465
SMILESCc1ccc(CS(=O)(=O)C(C)(C)[C@H](N)C(=O)N2C[C@@H](F)C[C@H]2C#N)cc1