Reaction Details
TargetDipeptidyl peptidase 4
LigandBDBM50173983
Substrate/Competitorn/a
Meas. Tech.ChEMBL_328423 (CHEMBL863964)
Ki 24±n/a nM
Citation Haffner, CDMcDougald, DLReister, SMThompson, BDConlee, CFang, JBass, JLenhard, JMCroom, DSecosky-Chang, MBTomaszek, TMcConn, DWells-Knecht, KJohnson, PR 2-Cyano-4-fluoro-1-thiovalylpyrrolidine analogues as potent inhibitors of DPP-IV. Bioorg Med Chem Lett15:5257-61 (2005) 
 
Dipeptidyl peptidase 4
Name:Dipeptidyl peptidase 4
Type:Enzyme
Mol. Mass.:88271.01
Organism:Homo sapiens (Human)
Description:P27487
Residue:766
BDBM50173983
NameBDBM50173983
Synonyms:(2S,4S)-1-((R)-2-amino-3-methyl-3-(3-phenylpropylthio)butanoyl)-4-fluoropyrrolidine-2-carbonitrile | CHEMBL198190
TypeSmall organic molecule
Emp. Form.C19H26FN3OS
Mol. Mass.363.493
SMILESCC(C)(SCCCc1ccccc1)[C@H](N)C(=O)N1C[C@@H](F)C[C@H]1C#N