Reaction Details
TargetPotassium/sodium hyperpolarization-activated cyclic nucleotide-gated channel 2
LigandBDBM50597430
Substrate/Competitorn/a
Meas. Tech.ChEMBL_2223430 (CHEMBL5136764)
IC50>30000±n/a nM
Citation Hill, MDBlanco, MJSalituro, FGBai, ZBeckley, JTAckley, MADai, JDoherty, JJHarrison, BLHoffmann, ECKazdoba, TMLanzetta, DLewis, MQuirk, MCRobichaud, AJ SAGE-718: A First-in-Class  J Med Chem65:9063-9075 (2022) 
 
Potassium/sodium hyperpolarization-activated cyclic nucleotide-gated channel 2
Name:Potassium/sodium hyperpolarization-activated cyclic nucleotide-gated channel 2
Type:PROTEIN
Mol. Mass.:96973.03
Organism:Homo sapiens (Human)
Description:ChEMBL_767273
Residue:889
BDBM50597430
NameBDBM50597430
Synonyms:DALZANEMDOR | Dalzanemdor
TypeSmall organic molecule
Emp. Form.C27H43F3O2
Mol. Mass.456.6243
SMILES[H][C@@]1(CC[C@@]2([H])[C@]3([H])CC=C4C[C@@](C)(O)CC[C@]4(C)[C@@]3([H])CC[C@]12C)[C@H](C)CC[C@](C)(O)C(F)(F)F