Reaction Details
Target5-hydroxytryptamine receptor 4
LigandBDBM50174435
Substrate/Competitorn/a
Meas. Tech.ChEMBL_320933 (CHEMBL882452)
Ki 9±n/a nM
Citation Soulier, JLRusso, OGiner, MRivail, LBerthouze, MOngeri, SMaigret, BFischmeister, RLezoualc'h, FSicsic, SBerque-Bestel, I Design and synthesis of specific probes for human 5-HT4 receptor dimerization studies. J Med Chem48:6220-8 (2005) 
 
5-hydroxytryptamine receptor 4
Name:5-hydroxytryptamine receptor 4
Type:Enzyme
Mol. Mass.:43767.54
Organism:Homo sapiens (Human)
Description:Q13639
Residue:388
BDBM50174435
NameBDBM50174435
Synonyms:1-[2-(4-amino-5-chloro-2-methoxyphenylcarbonyloxy)ethyl]-4-(3-{1-[2-(4-amino-5-chloro-2-methoxyphenylcarbonyloxy)ethyl]hexahydro-4-pyridinylmethylcarbamoyl}propylcarboxamidomethyl)hexahydropyridine | CHEMBL372479
TypeSmall organic molecule
Emp. Form.C37H52Cl2N6O8
Mol. Mass.779.75
SMILESCOc1cc(N)c(Cl)cc1C(=O)OCCN1CCC(CNC(=O)CCCC(=O)NCC2CCN(CCOC(=O)c3cc(Cl)c(N)cc3OC)CC2)CC1