Reaction Details
Target5-hydroxytryptamine receptor 4
LigandBDBM50174439
Substrate/Competitorn/a
Meas. Tech.ChEMBL_320933 (CHEMBL882452)
Ki 13±n/a nM
Citation Soulier, JLRusso, OGiner, MRivail, LBerthouze, MOngeri, SMaigret, BFischmeister, RLezoualc'h, FSicsic, SBerque-Bestel, I Design and synthesis of specific probes for human 5-HT4 receptor dimerization studies. J Med Chem48:6220-8 (2005) 
 
5-hydroxytryptamine receptor 4
Name:5-hydroxytryptamine receptor 4
Type:Enzyme
Mol. Mass.:43767.54
Organism:Homo sapiens (Human)
Description:Q13639
Residue:388
BDBM50174439
NameBDBM50174439
Synonyms:4-Amino-5-chloro-2-methoxy-benzoic acid 2-[4-(11-amino-undecanoylamino)-piperidin-1-yl]-ethyl ester | CHEMBL197965
TypeSmall organic molecule
Emp. Form.C26H43ClN4O4
Mol. Mass.511.097
SMILESCOc1cc(N)c(Cl)cc1C(=O)OCCN1CCC(CC1)NC(=O)CCCCCCCCCCN