Reaction Details
TargetAdenosine kinase
LigandBDBM50174602
Substrate/Competitorn/a
Meas. Tech.ChEMBL_321616 (CHEMBL872316)
IC50 0.3±n/a nM
Citation Boyer, SHUgarkar, BGSolbach, JKopcho, JMatelich, MCOllis, KGomez-Galeno, JEMendonca, RTsuchiya, MNagahisa, ANakane, MWiesner, JBErion, MD Adenosine kinase inhibitors. 5. Synthesis, enzyme inhibition, and analgesic activity of diaryl-erythro-furanosyltubercidin analogues. J Med Chem48:6430-41 (2005) 
 
Adenosine kinase
Name:Adenosine kinase
Type:PROTEIN
Mol. Mass.:40545.97
Organism:Homo sapiens (Human)
Description:ChEMBL_1467841
Residue:362
BDBM50174602
NameBDBM50174602
Synonyms:(4R,5R,6S)-5-[4-(4-Fluoro-phenylamino)-5-phenyl-pyrrolo[2,3-d]pyrimidin-7-yl]-4-oxa-spiro[2.4]heptane-6,7-diol | CHEMBL194294
TypeSmall organic molecule
Emp. Form.C24H21FN4O3
Mol. Mass.432.4469
SMILESO[C@@H]1[C@H](O)C2(CC2)O[C@H]1n1cc(-c2ccccc2)c2c(Nc3ccc(F)cc3)ncnc12