Reaction Details
TargetInosine-5'-monophosphate dehydrogenase 2
LigandBDBM50174782
Substrate/Competitorn/a
Meas. Tech.ChEMBL_326856 (CHEMBL860455)
IC50 45±n/a nM
Citation Birch, HLBuckley, GMDavies, NDyke, HJFrost, EJGilbert, PJHannah, DRHaughan, AFMadigan, MJMorgan, TPitt, WRRatcliffe, AJRay, NCRichard, MDSharpe, ATaylor, AJWhitworth, JMWilliams, SC Novel 7-methoxy-6-oxazol-5-yl-2,3-dihydro-1H-quinazolin-4-ones as IMPDH inhibitors. Bioorg Med Chem Lett15:5335-9 (2005) 
 
Inosine-5'-monophosphate dehydrogenase 2
Name:Inosine-5'-monophosphate dehydrogenase 2
Type:Enzyme
Mol. Mass.:55806.87
Organism:Homo sapiens (Human)
Description:Recombinant IMPDH2 expressed in E. coli.
Residue:514
BDBM50174782
NameBDBM50174782
Synonyms:CHEMBL198729 | N,N-diethyl-7'-methoxy-3'-methyl-6'-(1,3-oxazol-5-yl)-4'-oxo-3',4'-dihydro-1'H-spiro[pyrrolidine-3,2'-quinazoline]-1-carboxamide
TypeSmall organic molecule
Emp. Form.C21H27N5O4
Mol. Mass.413.4702
SMILESCCN(CC)C(=O)N1CCC2(C1)Nc1cc(OC)c(cc1C(=O)N2C)-c1cnco1