Reaction Details
TargetP2X purinoceptor 2
LigandBDBM50598316
Substrate/Competitorn/a
Meas. Tech.ChEMBL_2226725 (CHEMBL5140238)
EC50 8270±n/a nM
Citation Mahmood, AVillinger, AIqbal, J Therapeutic potentials and structure-activity relationship of 1,3-benzodioxole N-carbamothioyl carboxamide derivatives as selective and potent antagonists of P2X4 and P2X7 receptors. Eur J Med Chem238:0 (2022) 
 
P2X purinoceptor 2
Name:P2X purinoceptor 2
Type:Enzyme Catalytic Domain
Mol. Mass.:51765.18
Organism:Homo sapiens (Human)
Description:PurinergicP2X2/3 0 HUMAN::Q9UBL9
Residue:471
BDBM50598316
NameBDBM50598316
Synonyms:CHEMBL5184613
TypeSmall organic molecule
Emp. Form.C15H10Cl2N2O4S
Mol. Mass.385.222
SMILESOc1c(Cl)cc(NC(=S)NC(=O)c2ccc3OCOc3c2)cc1Cl