Reaction Details
TargetP2X purinoceptor 7
LigandBDBM50598327
Substrate/Competitorn/a
Meas. Tech.ChEMBL_2226733 (CHEMBL5140246)
EC50 9140±n/a nM
Citation Mahmood, AVillinger, AIqbal, J Therapeutic potentials and structure-activity relationship of 1,3-benzodioxole N-carbamothioyl carboxamide derivatives as selective and potent antagonists of P2X4 and P2X7 receptors. Eur J Med Chem238:0 (2022) 
 
P2X purinoceptor 7
Name:P2X purinoceptor 7
Type:Protein
Mol. Mass.:68602.85
Organism:Homo sapiens (Human)
Description:Q99572
Residue:595
BDBM50598327
NameBDBM50598327
Synonyms:CHEMBL5178892
TypeSmall organic molecule
Emp. Form.C18H13N3O3S
Mol. Mass.351.379
SMILESO=C(NC(=S)Nc1cccc2cccnc12)c1ccc2OCOc2c1