Reaction Details
TargetTyrosine-protein kinase Lck
LigandBDBM50175212
Substrate/Competitorn/a
Meas. Tech.ChEMBL_328615 (CHEMBL864487)
IC50 2350±n/a nM
Citation Burchat, ABorhani, DWCalderwood, DJHirst, GCLi, BStachlewitz, RF Discovery of A-770041, a src-family selective orally active lck inhibitor that prevents organ allograft rejection. Bioorg Med Chem Lett16:118-22 (2005) 
 
Tyrosine-protein kinase Lck
Name:Tyrosine-protein kinase Lck
Type:n/a
Mol. Mass.:57987.83
Organism:Homo sapiens (Human)
Description:P06239
Residue:509
BDBM50175212
NameBDBM50175212
Synonyms:CHEMBL200424 | N-(4-(4-amino-1-(1-(tetrahydro-2H-pyran-4-yl)piperidin-4-yl)-1H-pyrazolo[3,4-d]pyrimidin-3-yl)-2-methoxyphenyl)-4-(trifluoromethoxy)benzamide
TypeSmall organic molecule
Emp. Form.C30H32F3N7O4
Mol. Mass.611.6148
SMILESCOc1cc(ccc1NC(=O)c1ccc(OC(F)(F)F)cc1)-c1nn(C2CCN(CC2)C2CCOCC2)c2ncnc(N)c12