Reaction Details
TargetTyrosine-protein kinase Lck
LigandBDBM50175207
Substrate/Competitorn/a
Meas. Tech.ChEMBL_328615 (CHEMBL864487)
IC50 107±n/a nM
Citation Burchat, ABorhani, DWCalderwood, DJHirst, GCLi, BStachlewitz, RF Discovery of A-770041, a src-family selective orally active lck inhibitor that prevents organ allograft rejection. Bioorg Med Chem Lett16:118-22 (2005) 
 
Tyrosine-protein kinase Lck
Name:Tyrosine-protein kinase Lck
Type:n/a
Mol. Mass.:57987.83
Organism:Homo sapiens (Human)
Description:P06239
Residue:509
BDBM50175207
NameBDBM50175207
Synonyms:A-641359 N-(4-(4-amino-1-(1-(tetrahydro-2H-pyran-4-yl)piperidin-4-yl)-1H-pyrazolo[3,4-d]pyrimidin-3-yl)-2-methoxyphenyl)-1-methyl-1H-indole-2-carboxamide | N-(4-{4-AMINO-1-[1-(TETRAHYDRO-2H-PYRAN-4-YL)PIPERIDIN-4-YL]-1H-PYRAZOLO[3,4-D]PYRIMIDIN-3-YL}-2-METHOXYPHENYL)-1-METHYL-1H-INDOLE-2-CARBOXAMIDE
TypeSmall organic molecule
Emp. Form.C32H36N8O3
Mol. Mass.580.68
SMILESCOc1cc(ccc1NC(=O)c1cc2ccccc2n1C)-c1nn(C2CCN(CC2)C2CCOCC2)c2ncnc(N)c12