Reaction Details
TargetMethionine aminopeptidase
LigandBDBM50175442
Substrate/Competitorn/a
Meas. Tech.ChEMBL_326945 (CHEMBL853286)
IC50 138000±n/a nM
Citation Huang, QQHuang, MNan, FJYe, QZ Metalloform-selective inhibition: synthesis and structure-activity analysis of Mn(II)-form-selective inhibitors of Escherichia coli methionine aminopeptidase. Bioorg Med Chem Lett15:5386-91 (2005) 
 
Methionine aminopeptidase
Name:Methionine aminopeptidase
Type:Enzyme
Mol. Mass.:29326.96
Organism:Escherichia coli (strain K12)
Description:Full-length untagged EcMAP was expressed in E. coli.
Residue:264
BDBM50175442
NameBDBM50175442
Synonyms:5-(2-chlorophenyl)furan-2-carboxylic acid cid_784625
TypeSmall organic molecule
Emp. Form.C11H7ClO3
Mol. Mass.222.624
SMILESOC(=O)c1ccc(o1)-c1ccccc1Cl