Reaction Details
Target5-hydroxytryptamine receptor 1B
LigandBDBM50175463
Substrate/Competitorn/a
Meas. Tech.ChEMBL_326566 (CHEMBL859777)
Ki 0.5±n/a nM
Citation Kling, ALange, UEMack, HBakker, MHDrescher, KUHornberger, WHutchins, CWMöller, AMüller, RSchmidt, MUnger, LWicke, KSchellhaas, KSteiner, G Synthesis and SAR of highly potent dual 5-HT1A and 5-HT1B antagonists as potential antidepressant drugs. Bioorg Med Chem Lett15:5567-73 (2005) 
 
5-hydroxytryptamine receptor 1B
Name:5-hydroxytryptamine receptor 1B
Type:G Protein-Coupled Receptor (GPCR)
Mol. Mass.:43579.17
Organism:Homo sapiens (Human)
Description:Receptor binding assays were performed using human clone stably expressed in CHO cells
Residue:390
BDBM50175463
NameBDBM50175463
Synonyms:3-{2-[4-(3-chloro-2-methoxy-phenyl)-piperazin-1-yl]-ethyl}-7-methyl-5,6,7,8-tetrahydro-3H-pyrido[4',3':4,5]thieno[2,3-d]pyrimidin-4-one | CHEMBL196914
TypeSmall organic molecule
Emp. Form.C23H28ClN5O2S
Mol. Mass.474.019
SMILESCOc1c(Cl)cccc1N1CCN(CCn2cnc3sc4CN(C)CCc4c3c2=O)CC1