Reaction Details
Target5-hydroxytryptamine receptor 1B
LigandBDBM50175473
Substrate/Competitorn/a
Meas. Tech.ChEMBL_326566 (CHEMBL859777)
Ki 0.9±n/a nM
Citation Kling, ALange, UEMack, HBakker, MHDrescher, KUHornberger, WHutchins, CWMöller, AMüller, RSchmidt, MUnger, LWicke, KSchellhaas, KSteiner, G Synthesis and SAR of highly potent dual 5-HT1A and 5-HT1B antagonists as potential antidepressant drugs. Bioorg Med Chem Lett15:5567-73 (2005) 
 
5-hydroxytryptamine receptor 1B
Name:5-hydroxytryptamine receptor 1B
Type:G Protein-Coupled Receptor (GPCR)
Mol. Mass.:43579.17
Organism:Homo sapiens (Human)
Description:Receptor binding assays were performed using human clone stably expressed in CHO cells
Residue:390
BDBM50175473
NameBDBM50175473
Synonyms:3-[2-(4-isoquinolin-5-yl-piperazin-1-yl)-ethyl]-7-methyl-5,6,7,8-tetrahydro-3H-pyrido[4',3':4,5]thieno[2,3-d]pyrimidin-4-one | CHEMBL199269
TypeSmall organic molecule
Emp. Form.C25H28N6OS
Mol. Mass.460.594
SMILESCN1CCc2c(C1)sc1ncn(CCN3CCN(CC3)c3cccc4cnccc34)c(=O)c21