Reaction Details
TargetD(3) dopamine receptor
LigandBDBM50175465
Substrate/Competitorn/a
Meas. Tech.ChEMBL_326580 (CHEMBL863369)
Ki 1.3±n/a nM
Citation Kling, ALange, UEMack, HBakker, MHDrescher, KUHornberger, WHutchins, CWMöller, AMüller, RSchmidt, MUnger, LWicke, KSchellhaas, KSteiner, G Synthesis and SAR of highly potent dual 5-HT1A and 5-HT1B antagonists as potential antidepressant drugs. Bioorg Med Chem Lett15:5567-73 (2005) 
 
D(3) dopamine receptor
Name:D(3) dopamine receptor
Type:n/a
Mol. Mass.:44243.43
Organism:Homo sapiens (Human)
Description:n/a
Residue:400
BDBM50175465
NameBDBM50175465
Synonyms:7-methyl-3-[2-(4-quinolin-4-yl-piperazin-1-yl)-ethyl]-5,6,7,8-tetrahydro-3H-pyrido[4',3':4,5]thieno[2,3-d]pyrimidin-4-one | CHEMBL198463
TypeSmall organic molecule
Emp. Form.C25H28N6OS
Mol. Mass.460.594
SMILESCN1CCc2c(C1)sc1ncn(CCN3CCN(CC3)c3ccnc4ccccc34)c(=O)c21