Reaction Details
Target5-hydroxytryptamine receptor 1A
LigandBDBM50175490
Substrate/Competitorn/a
Meas. Tech.ChEMBL_326565 (CHEMBL859776)
Ki 2.9±n/a nM
Citation Kling, ALange, UEMack, HBakker, MHDrescher, KUHornberger, WHutchins, CWMöller, AMüller, RSchmidt, MUnger, LWicke, KSchellhaas, KSteiner, G Synthesis and SAR of highly potent dual 5-HT1A and 5-HT1B antagonists as potential antidepressant drugs. Bioorg Med Chem Lett15:5567-73 (2005) 
 
5-hydroxytryptamine receptor 1A
Name:5-hydroxytryptamine receptor 1A
Type:n/a
Mol. Mass.:46122.49
Organism:Homo sapiens (Human)
Description:n/a
Residue:422
BDBM50175490
NameBDBM50175490
Synonyms:7-methyl-3-[2-(4-o-tolyl-piperazin-1-yl)-ethyl]-5,6,7,8-tetrahydro-3H-pyrido[4',3':4,5]thieno[2,3-d]pyrimidin-4-one | CHEMBL197078
TypeSmall organic molecule
Emp. Form.C23H29N5OS
Mol. Mass.423.574
SMILESCN1CCc2c(C1)sc1ncn(CCN3CCN(CC3)c3ccccc3C)c(=O)c21