Reaction Details
TargetD(2) dopamine receptor
LigandBDBM50175461
Substrate/Competitorn/a
Meas. Tech.ChEMBL_326581 (CHEMBL863370)
Ki 1.2±n/a nM
Citation Kling, ALange, UEMack, HBakker, MHDrescher, KUHornberger, WHutchins, CWMöller, AMüller, RSchmidt, MUnger, LWicke, KSchellhaas, KSteiner, G Synthesis and SAR of highly potent dual 5-HT1A and 5-HT1B antagonists as potential antidepressant drugs. Bioorg Med Chem Lett15:5567-73 (2005) 
 
D(2) dopamine receptor
Name:D(2) dopamine receptor
Type:Cell-surface receptors
Mol. Mass.:50647.10
Organism:Homo sapiens (Human)
Description:P14416
Residue:443
BDBM50175461
NameBDBM50175461
Synonyms:3-[2-(4-isoquinolin-4-yl-piperazin-1-yl)-ethyl]-7-methyl-5,6,7,8-tetrahydro-3H-pyrido[4',3':4,5]thieno[2,3-d]pyrimidin-4-one | CHEMBL370110
TypeSmall organic molecule
Emp. Form.C25H28N6OS
Mol. Mass.460.594
SMILESCN1CCc2c(C1)sc1ncn(CCN3CCN(CC3)c3cncc4ccccc34)c(=O)c21