Reaction Details
TargetReverse transcriptase/RNaseH
LigandBDBM50175614
Substrate/Competitorn/a
Meas. Tech.ChEMBL_321370 (CHEMBL881514)
IC50>500000±n/a nM
Citation Bonache, MCChamorro, CVelázquez, SDe Clercq, EBalzarini, JBarrios, FRGago, FCamarasa, MJSan-Félix, A Improving the antiviral efficacy and selectivity of HIV-1 reverse transcriptase inhibitor TSAO-T by the introduction of functional groups at the N-3 position. J Med Chem48:6653-60 (2005) 
 
Reverse transcriptase/RNaseH
Name:Reverse transcriptase/RNaseH
Type:PROTEIN
Mol. Mass.:65229.15
Organism:Human immunodeficiency virus 1
Description:ChEMBL_1473730
Residue:566
BDBM50175614
NameBDBM50175614
Synonyms:1-[4-Amino-9-(tert-butyl-dimethyl-silanyloxy)-6-(tert-butyl-dimethyl-silanyloxymethyl)-2,2-dioxo-1,7-dioxa-2lambda*6*-thia-spiro[4.4]non-3-en-8-yl]-3-cyclopropylmethyl-5-methyl-1H-pyrimidine-2,4-dione | CHEMBL3143766
TypeSmall organic molecule
Emp. Form.C28H49N3O8SSi2
Mol. Mass.643.94
SMILESCc1cn([C@@H]2O[C@H](CO[Si](C)(C)C(C)(C)C)[C@@]3(OS(=O)(=O)C=C3N)[C@H]2O[Si](C)(C)C(C)(C)C)c(=O)n(CC2CC2)c1=O