Reaction Details
TargetLysine-specific demethylase 4B
LigandBDBM50158844
Substrate/Competitorn/a
Meas. Tech.ChEMBL_2227652 (CHEMBL5141165)
IC50 10.0±n/a nM
Citation Wu, QYoung, BWang, YDavidoff, AMRankovic, ZYang, J Recent Advances with KDM4 Inhibitors and Potential Applications. J Med Chem65:9564-9579 (2022) 
 
Lysine-specific demethylase 4B
Name:Lysine-specific demethylase 4B
Type:PROTEIN
Mol. Mass.:121904.33
Organism:Homo sapiens (Human)
Description:ChEMBL_109446
Residue:1096
BDBM50158844
NameBDBM50158844
Synonyms:CHEMBL3785491
TypeSmall organic molecule
Emp. Form.C25H22N2O2
Mol. Mass.382.4544
SMILESOc1cc(cc2cccnc12)-c1cccc(c1)C(=O)NCCCc1ccccc1