Reaction Details
TargetLysine-specific demethylase 4B
LigandBDBM50598660
Substrate/Competitorn/a
Meas. Tech.ChEMBL_2227676 (CHEMBL5141189)
IC50 33±n/a nM
Citation Wu, QYoung, BWang, YDavidoff, AMRankovic, ZYang, J Recent Advances with KDM4 Inhibitors and Potential Applications. J Med Chem65:9564-9579 (2022) 
 
Lysine-specific demethylase 4B
Name:Lysine-specific demethylase 4B
Type:PROTEIN
Mol. Mass.:121904.33
Organism:Homo sapiens (Human)
Description:ChEMBL_109446
Residue:1096
BDBM50598660
NameBDBM50598660
Synonyms:CHEMBL5203308
TypeSmall organic molecule
Emp. Form.C88H116N24O22S
Mol. Mass.1894.075
SMILESCC(C)[C@@H]1NC(=O)[C@@H](Cc2ccc(O)cc2)NC(=O)CSC[C@H](NC(=O)[C@@H](NC(=O)[C@H](Cc2ccc(O)cc2)NC(=O)[C@H](Cc2c[nH]c3ccccc23)NC(=O)[C@H](CCCNC(N)=N)NC(=O)[C@H](Cc2c[nH]c3ccccc23)NC(=O)CNC(=O)[C@H](CO)NC(=O)[C@H](CCCNC(N)=N)NC(=O)[C@@H](NC(=O)[C@H](CC(N)=O)NC(=O)[C@H](Cc2ccc(O)cc2)NC1=O)[C@@H](C)O)[C@@H](C)O)C(N)=O