Reaction Details
TargetHeparanase
LigandBDBM50175813
Substrate/Competitorn/a
Meas. Tech.ChEMBL_327891 (CHEMBL868733)
IC50 290±n/a nM
Citation Xu, YJMiao, HQPan, WNavarro, ECTonra, JRMitelman, SCamara, MMDeevi, DSKiselyov, ASKussie, PWong, WCLiu, H N-(4-{[4-(1H-Benzoimidazol-2-yl)-arylamino]-methyl}-phenyl)-benzamide derivatives as small molecule heparanase inhibitors. Bioorg Med Chem Lett16:404-8 (2005) 
 
Heparanase
Name:Heparanase
Type:PROTEIN
Mol. Mass.:61167.67
Organism:Homo sapiens (Human)
Description:ChEMBL_327900
Residue:543
BDBM50175813
NameBDBM50175813
Synonyms:CHEMBL200831 | N-(4-{[5-(1H-benzoimidazol-2-yl)-pyridin-2-ylamino]methyl}-phenyl)-3-bromo-4-methoxy-benzamide
TypeSmall organic molecule
Emp. Form.C27H22BrN5O2
Mol. Mass.528.4
SMILESCOc1ccc(cc1Br)C(=O)Nc1ccc(CNc2ccc(cn2)-c2nc3ccccc3[nH]2)cc1