Reaction Details
TargetCannabinoid receptor 1
LigandBDBM50176426
Substrate/Competitorn/a
Meas. Tech.ChEMBL_332949 (CHEMBL854079)
IC50 55±n/a nM
Citation Debenham, JSMadsen-Duggan, CBWalsh, TFWang, JTong, XDoss, GALao, JFong, TMSchaeffer, MTXiao, JCHuang, CRShen, CPFeng, YMarsh, DJStribling, DSShearman, LPStrack, AMMacIntyre, DEVan der Ploeg, LHGoulet, MT Synthesis of functionalized 1,8-naphthyridinones and their evaluation as novel, orally active CB1 receptor inverse agonists. Bioorg Med Chem Lett16:681-5 (2005) 
 
Cannabinoid receptor 1
Name:Cannabinoid receptor 1
Type:G Protein-Coupled Receptor (GPCR)
Mol. Mass.:52868.96
Organism:Homo sapiens (Human)
Description:P21554
Residue:472
BDBM50176426
NameBDBM50176426
Synonyms:3-acetyl-6-(4-chlorophenyl)-7-(2,4-dichlorophenyl)-1,4-dimethyl-1,8-naphthyridin-2(1H)-one | CHEMBL202202
TypeSmall organic molecule
Emp. Form.C24H17Cl3N2O2
Mol. Mass.471.763
SMILESCC(=O)c1c(C)c2cc(-c3ccc(Cl)cc3)c(nc2n(C)c1=O)-c1ccc(Cl)cc1Cl