Reaction Details
TargetCannabinoid receptor 2
LigandBDBM50176424
Substrate/Competitorn/a
Meas. Tech.ChEMBL_332950 (CHEMBL854080)
IC50 6200±n/a nM
Citation Debenham, JSMadsen-Duggan, CBWalsh, TFWang, JTong, XDoss, GALao, JFong, TMSchaeffer, MTXiao, JCHuang, CRShen, CPFeng, YMarsh, DJStribling, DSShearman, LPStrack, AMMacIntyre, DEVan der Ploeg, LHGoulet, MT Synthesis of functionalized 1,8-naphthyridinones and their evaluation as novel, orally active CB1 receptor inverse agonists. Bioorg Med Chem Lett16:681-5 (2005) 
 
Cannabinoid receptor 2
Name:Cannabinoid receptor 2
Type:G Protein-Coupled Receptor (GPCR)
Mol. Mass.:39690.94
Organism:Homo sapiens (Human)
Description:P34972
Residue:360
BDBM50176424
NameBDBM50176424
Synonyms:CHEMBL201388 | N-(3-acetyl-6-(4-chlorophenyl)-7-(2,4-dichlorophenyl)-1-isobutyl-2-oxo-1,2-dihydro-1,8-naphthyridin-4-yl)acetamide
TypeSmall organic molecule
Emp. Form.C28H24Cl3N3O3
Mol. Mass.556.867
SMILESCC(C)Cn1c2nc(-c3ccc(Cl)cc3Cl)c(cc2c(NC(C)=O)c(C(C)=O)c1=O)-c1ccc(Cl)cc1