Reaction Details
TargetCannabinoid receptor 1
LigandBDBM50176423
Substrate/Competitorn/a
Meas. Tech.ChEMBL_332949 (CHEMBL854079)
IC50 5.2±n/a nM
Citation Debenham, JSMadsen-Duggan, CBWalsh, TFWang, JTong, XDoss, GALao, JFong, TMSchaeffer, MTXiao, JCHuang, CRShen, CPFeng, YMarsh, DJStribling, DSShearman, LPStrack, AMMacIntyre, DEVan der Ploeg, LHGoulet, MT Synthesis of functionalized 1,8-naphthyridinones and their evaluation as novel, orally active CB1 receptor inverse agonists. Bioorg Med Chem Lett16:681-5 (2005) 
 
Cannabinoid receptor 1
Name:Cannabinoid receptor 1
Type:G Protein-Coupled Receptor (GPCR)
Mol. Mass.:52868.96
Organism:Homo sapiens (Human)
Description:P21554
Residue:472
BDBM50176423
NameBDBM50176423
Synonyms:CHEMBL202064 | N-(3-acetyl-6-(4-chlorophenyl)-7-(2,4-dichlorophenyl)-2-oxo-1-((tetrahydrofuran-2-yl)methyl)-1,2-dihydro-1,8-naphthyridin-4-yl)acetamide
TypeSmall organic molecule
Emp. Form.C29H24Cl3N3O4
Mol. Mass.584.878
SMILESCC(=O)Nc1c(C(C)=O)c(=O)n(CC2CCCO2)c2nc(-c3ccc(Cl)cc3Cl)c(cc12)-c1ccc(Cl)cc1