Reaction Details
TargetCannabinoid receptor 2
LigandBDBM50176429
Substrate/Competitorn/a
Meas. Tech.ChEMBL_332950 (CHEMBL854080)
IC50 1500±n/a nM
Citation Debenham, JSMadsen-Duggan, CBWalsh, TFWang, JTong, XDoss, GALao, JFong, TMSchaeffer, MTXiao, JCHuang, CRShen, CPFeng, YMarsh, DJStribling, DSShearman, LPStrack, AMMacIntyre, DEVan der Ploeg, LHGoulet, MT Synthesis of functionalized 1,8-naphthyridinones and their evaluation as novel, orally active CB1 receptor inverse agonists. Bioorg Med Chem Lett16:681-5 (2005) 
 
Cannabinoid receptor 2
Name:Cannabinoid receptor 2
Type:G Protein-Coupled Receptor (GPCR)
Mol. Mass.:39690.94
Organism:Homo sapiens (Human)
Description:P34972
Residue:360
BDBM50176429
NameBDBM50176429
Synonyms:CHEMBL380483 | N-(3-acetyl-6-(4-chlorophenyl)-7-(2,4-dichlorophenyl)-1-(2-hydroxyethyl)-2-oxo-1,2-dihydro-1,8-naphthyridin-4-yl)acetamide
TypeSmall organic molecule
Emp. Form.C26H20Cl3N3O4
Mol. Mass.544.814
SMILESCC(=O)Nc1c(C(C)=O)c(=O)n(CCO)c2nc(-c3ccc(Cl)cc3Cl)c(cc12)-c1ccc(Cl)cc1