Reaction Details
TargetcGMP-specific 3',5'-cyclic phosphodiesterase
LigandBDBM28393
Substrate/Competitorn/a
Meas. Tech.ChEMBL_327542 (CHEMBL854357)
IC50>16000±n/a nM
Citation Chambers, RJAbrams, KGarceau, NYKamath, AVManley, CMLilley, SCOtte, DAScott, DOSheils, ALTess, DAVellekoop, ASZhang, YLam, KT A new chemical tool for exploring the physiological function of the PDE2 isozyme. Bioorg Med Chem Lett16:307-10 (2005) 
 
cGMP-specific 3',5'-cyclic phosphodiesterase
Name:cGMP-specific 3',5'-cyclic phosphodiesterase
Type:Protein
Mol. Mass.:99975.83
Organism:Homo sapiens (Human)
Description:O76074
Residue:875
BDBM28393
NameBDBM28393
Synonyms:(+)-EHNA CHEMBL296435
TypeSmall organic molecule
Emp. Form.C14H23N5O
Mol. Mass.277.3653
SMILESCCCCCC[C@H]([C@H](C)O)n1cnc2c(N)ncnc12