Reaction Details
TargetDual 3',5'-cyclic-AMP and -GMP phosphodiesterase 11A
LigandBDBM50176521
Substrate/Competitorn/a
Meas. Tech.ChEMBL_327547 (CHEMBL854362)
IC50 11600±n/a nM
Citation Chambers, RJAbrams, KGarceau, NYKamath, AVManley, CMLilley, SCOtte, DAScott, DOSheils, ALTess, DAVellekoop, ASZhang, YLam, KT A new chemical tool for exploring the physiological function of the PDE2 isozyme. Bioorg Med Chem Lett16:307-10 (2005) 
 
Dual 3',5'-cyclic-AMP and -GMP phosphodiesterase 11A
Name:Dual 3',5'-cyclic-AMP and -GMP phosphodiesterase 11A
Type:Enzyme
Mol. Mass.:104751.53
Organism:Homo sapiens (Human)
Description:Q9HCR9
Residue:933
BDBM50176521
NameBDBM50176521
Synonyms:5-methyl-6-oxo-6,7-dihydro-5H-furo[2,3-f]indole-7-carboxylic acid [1,3,4]thiadiazol-2-ylamide | CHEMBL200906
TypeSmall organic molecule
Emp. Form.C14H10N4O3S
Mol. Mass.314.319
SMILESCN1C(=O)C(C(=O)Nc2nncs2)c2cc3occc3cc12