Reaction Details
TargetDual 3',5'-cyclic-AMP and -GMP phosphodiesterase 11A
LigandBDBM28393
Substrate/Competitorn/a
Meas. Tech.ChEMBL_327547 (CHEMBL854362)
IC50>16000±n/a nM
Citation Chambers, RJAbrams, KGarceau, NYKamath, AVManley, CMLilley, SCOtte, DAScott, DOSheils, ALTess, DAVellekoop, ASZhang, YLam, KT A new chemical tool for exploring the physiological function of the PDE2 isozyme. Bioorg Med Chem Lett16:307-10 (2005) 
 
Dual 3',5'-cyclic-AMP and -GMP phosphodiesterase 11A
Name:Dual 3',5'-cyclic-AMP and -GMP phosphodiesterase 11A
Type:Enzyme
Mol. Mass.:104751.53
Organism:Homo sapiens (Human)
Description:Q9HCR9
Residue:933
BDBM28393
NameBDBM28393
Synonyms:(+)-EHNA CHEMBL296435
TypeSmall organic molecule
Emp. Form.C14H23N5O
Mol. Mass.277.3653
SMILESCCCCCC[C@H]([C@H](C)O)n1cnc2c(N)ncnc12