Reaction Details
TargetEctonucleotide pyrophosphatase/phosphodiesterase family member 2
LigandBDBM50177334
Substrate/Competitorn/a
Meas. Tech.ChEMBL_329851 (CHEMBL869921)
IC50 449±n/a nM
Citation Gududuru, VZeng, KTsukahara, RMakarova, NFujiwara, YPigg, KRBaker, DLTigyi, GMiller, DD Identification of Darmstoff analogs as selective agonists and antagonists of lysophosphatidic acid receptors. Bioorg Med Chem Lett16:451-6 (2005) 
 
Ectonucleotide pyrophosphatase/phosphodiesterase family member 2
Name:Ectonucleotide pyrophosphatase/phosphodiesterase family member 2
Type:Enzyme
Mol. Mass.:99007.13
Organism:Homo sapiens (Human)
Description:Q13822
Residue:863
BDBM50177334
NameBDBM50177334
Synonyms:CHEMBL198406 | potassium O-(2-(6-(4-octylphenyl)hexyl)-1,3-dioxolan-4-yl)methyl O-hydrogenphosphorothioate
TypeSmall organic molecule
Emp. Form.C24H40O5PS
Mol. Mass.471.611
SMILESCCCCCCCCc1ccc(CCCCCCC2OCC(COP(O)([O-])=S)O2)cc1