Reaction Details
TargetLysophosphatidic acid receptor 1
LigandBDBM50177331
Substrate/Competitorn/a
Meas. Tech.ChEMBL_329844 (CHEMBL862793)
IC50 1110±n/a nM
Citation Gududuru, VZeng, KTsukahara, RMakarova, NFujiwara, YPigg, KRBaker, DLTigyi, GMiller, DD Identification of Darmstoff analogs as selective agonists and antagonists of lysophosphatidic acid receptors. Bioorg Med Chem Lett16:451-6 (2005) 
 
Lysophosphatidic acid receptor 1
Name:Lysophosphatidic acid receptor 1
Type:PROTEIN
Mol. Mass.:41130.42
Organism:Rattus norvegicus
Description:ChEMBL_329844
Residue:364
BDBM50177331
NameBDBM50177331
Synonyms:CHEMBL381470 | potassium (2-dodecyl-1,3-dioxolan-4-yl)methyl hydrogenphosphate
TypeSmall organic molecule
Emp. Form.C16H32O6P
Mol. Mass.351.396
SMILESCCCCCCCCCCCCC1OCC(COP(O)([O-])=O)O1