Reaction Details
TargetEctonucleotide pyrophosphatase/phosphodiesterase family member 2
LigandBDBM50177338
Substrate/Competitorn/a
Meas. Tech.ChEMBL_329851 (CHEMBL869921)
IC50 803±n/a nM
Citation Gududuru, VZeng, KTsukahara, RMakarova, NFujiwara, YPigg, KRBaker, DLTigyi, GMiller, DD Identification of Darmstoff analogs as selective agonists and antagonists of lysophosphatidic acid receptors. Bioorg Med Chem Lett16:451-6 (2005) 
 
Ectonucleotide pyrophosphatase/phosphodiesterase family member 2
Name:Ectonucleotide pyrophosphatase/phosphodiesterase family member 2
Type:Enzyme
Mol. Mass.:99007.13
Organism:Homo sapiens (Human)
Description:Q13822
Residue:863
BDBM50177338
NameBDBM50177338
Synonyms:CHEMBL383362 | potassium (2-(heptadeca-9,12,15-trienyl)-1,3-dioxolan-4-yl)methyl hydrogenphosphate
TypeSmall organic molecule
Emp. Form.C21H36O6P
Mol. Mass.415.4813
SMILESC\C=C\C\C=C\C\C=C\CCCCCCCCC1OCC(COP(O)([O-])=O)O1