Reaction Details
TargetEctonucleotide pyrophosphatase/phosphodiesterase family member 2
LigandBDBM50177340
Substrate/Competitorn/a
Meas. Tech.ChEMBL_329851 (CHEMBL869921)
IC50 238±n/a nM
Citation Gududuru, VZeng, KTsukahara, RMakarova, NFujiwara, YPigg, KRBaker, DLTigyi, GMiller, DD Identification of Darmstoff analogs as selective agonists and antagonists of lysophosphatidic acid receptors. Bioorg Med Chem Lett16:451-6 (2005) 
 
Ectonucleotide pyrophosphatase/phosphodiesterase family member 2
Name:Ectonucleotide pyrophosphatase/phosphodiesterase family member 2
Type:Enzyme
Mol. Mass.:99007.13
Organism:Homo sapiens (Human)
Description:Q13822
Residue:863
BDBM50177340
NameBDBM50177340
Synonyms:CHEMBL382116 | potassium ((2R,4S)-2-(heptadec-9-enyl)-1,3-dioxolan-4-yl)methyl hydrogenphosphate
TypeSmall organic molecule
Emp. Form.C21H40O6P
Mol. Mass.419.513
SMILESCCCCCCC\C=C\CCCCCCCC[C@@H]1OC[C@@H](COP(O)([O-])=O)O1