Reaction Details
TargetEctonucleotide pyrophosphatase/phosphodiesterase family member 2
LigandBDBM50177335
Substrate/Competitorn/a
Meas. Tech.ChEMBL_329851 (CHEMBL869921)
IC50 344±n/a nM
Citation Gududuru, VZeng, KTsukahara, RMakarova, NFujiwara, YPigg, KRBaker, DLTigyi, GMiller, DD Identification of Darmstoff analogs as selective agonists and antagonists of lysophosphatidic acid receptors. Bioorg Med Chem Lett16:451-6 (2005) 
 
Ectonucleotide pyrophosphatase/phosphodiesterase family member 2
Name:Ectonucleotide pyrophosphatase/phosphodiesterase family member 2
Type:Enzyme
Mol. Mass.:99007.13
Organism:Homo sapiens (Human)
Description:Q13822
Residue:863
BDBM50177335
NameBDBM50177335
Synonyms:CHEMBL199400 | potassium O-((2R,4R)-2-(heptadec-9-enyl)-1,3-dioxolan-4-yl)methyl O-hydrogenphosphorothioate
TypeSmall organic molecule
Emp. Form.C21H40O5PS
Mol. Mass.435.579
SMILESCCCCCCC\C=C\CCCCCCCC[C@@H]1OC[C@H](COP(O)([O-])=S)O1