Reaction Details
TargetLysophosphatidic acid receptor 3
LigandBDBM50177329
Substrate/Competitorn/a
Meas. Tech.ChEMBL_329846 (CHEMBL862795)
IC50 504±n/a nM
Citation Gududuru, VZeng, KTsukahara, RMakarova, NFujiwara, YPigg, KRBaker, DLTigyi, GMiller, DD Identification of Darmstoff analogs as selective agonists and antagonists of lysophosphatidic acid receptors. Bioorg Med Chem Lett16:451-6 (2005) 
 
Lysophosphatidic acid receptor 3
Name:Lysophosphatidic acid receptor 3
Type:PROTEIN
Mol. Mass.:40307.81
Organism:Rattus norvegicus
Description:ChEMBL_329846
Residue:354
BDBM50177329
NameBDBM50177329
Synonyms:CHEMBL199380 | potassium (2-(6-(4-octylphenyl)hexyl)-1,3-dioxolan-4-yl)methyl hydrogenphosphate
TypeSmall organic molecule
Emp. Form.C24H40O6P
Mol. Mass.455.5451
SMILESCCCCCCCCc1ccc(CCCCCCC2OCC(COP(O)([O-])=O)O2)cc1