Reaction Details
TargetLysophosphatidic acid receptor 1
LigandBDBM50177328
Substrate/Competitorn/a
Meas. Tech.ChEMBL_329844 (CHEMBL862793)
EC50 1580±n/a nM
Citation Gududuru, VZeng, KTsukahara, RMakarova, NFujiwara, YPigg, KRBaker, DLTigyi, GMiller, DD Identification of Darmstoff analogs as selective agonists and antagonists of lysophosphatidic acid receptors. Bioorg Med Chem Lett16:451-6 (2005) 
 
Lysophosphatidic acid receptor 1
Name:Lysophosphatidic acid receptor 1
Type:PROTEIN
Mol. Mass.:41130.42
Organism:Rattus norvegicus
Description:ChEMBL_329844
Residue:364
BDBM50177328
NameBDBM50177328
Synonyms:CHEMBL427014 | potassium O-((2S,4R)-2-(heptadec-9-enyl)-1,3-dioxolan-4-yl)methyl O-hydrogenphosphorothioate
TypeSmall organic molecule
Emp. Form.C21H40O5PS
Mol. Mass.435.579
SMILESCCCCCCC\C=C\CCCCCCCC[C@H]1OC[C@H](COP(O)([O-])=S)O1