Reaction Details
TargetLysophosphatidic acid receptor 1
LigandBDBM50177332
Substrate/Competitorn/a
Meas. Tech.ChEMBL_329844 (CHEMBL862793)
EC50 981±n/a nM
Citation Gududuru, VZeng, KTsukahara, RMakarova, NFujiwara, YPigg, KRBaker, DLTigyi, GMiller, DD Identification of Darmstoff analogs as selective agonists and antagonists of lysophosphatidic acid receptors. Bioorg Med Chem Lett16:451-6 (2005) 
 
Lysophosphatidic acid receptor 1
Name:Lysophosphatidic acid receptor 1
Type:PROTEIN
Mol. Mass.:41130.42
Organism:Rattus norvegicus
Description:ChEMBL_329844
Residue:364
BDBM50177332
NameBDBM50177332
Synonyms:CHEMBL199472 | potassium O-(2-(heptadec-9-enyl)-1,3-dioxolan-4-yl)methyl O-hydrogenphosphorothioate
TypeSmall organic molecule
Emp. Form.C21H40O5PS
Mol. Mass.435.579
SMILESCCCCCCC\C=C\CCCCCCCCC1OCC(COP(O)([O-])=S)O1