Reaction Details
TargetLysophosphatidic acid receptor 1
LigandBDBM50177336
Substrate/Competitorn/a
Meas. Tech.ChEMBL_329844 (CHEMBL862793)
IC50 915±n/a nM
Citation Gududuru, VZeng, KTsukahara, RMakarova, NFujiwara, YPigg, KRBaker, DLTigyi, GMiller, DD Identification of Darmstoff analogs as selective agonists and antagonists of lysophosphatidic acid receptors. Bioorg Med Chem Lett16:451-6 (2005) 
 
Lysophosphatidic acid receptor 1
Name:Lysophosphatidic acid receptor 1
Type:PROTEIN
Mol. Mass.:41130.42
Organism:Rattus norvegicus
Description:ChEMBL_329844
Residue:364
BDBM50177336
NameBDBM50177336
Synonyms:CHEMBL373007 | potassium (2-(heptadec-9-enyl)-1,3-dioxolan-4-yl)methyl hydrogenphosphate
TypeSmall organic molecule
Emp. Form.C21H40O6P
Mol. Mass.419.513
SMILESCCCCCCC\C=C\CCCCCCCCC1OCC(COP(O)([O-])=O)O1