Reaction Details
TargetLysophosphatidic acid receptor 3
LigandBDBM50177333
Substrate/Competitorn/a
Meas. Tech.ChEMBL_329846 (CHEMBL862795)
EC50 204±n/a nM
Citation Gududuru, VZeng, KTsukahara, RMakarova, NFujiwara, YPigg, KRBaker, DLTigyi, GMiller, DD Identification of Darmstoff analogs as selective agonists and antagonists of lysophosphatidic acid receptors. Bioorg Med Chem Lett16:451-6 (2005) 
 
Lysophosphatidic acid receptor 3
Name:Lysophosphatidic acid receptor 3
Type:PROTEIN
Mol. Mass.:40307.81
Organism:Rattus norvegicus
Description:ChEMBL_329846
Residue:354
BDBM50177333
NameBDBM50177333
Synonyms:CHEMBL200003 | potassium O-((2R,4S)-2-(heptadec-9-enyl)-1,3-dioxolan-4-yl)methyl O-hydrogenphosphorothioate
TypeSmall organic molecule
Emp. Form.C21H40O5PS
Mol. Mass.435.579
SMILESCCCCCCC\C=C\CCCCCCCC[C@@H]1OC[C@@H](COP(O)([O-])=S)O1