Reaction Details
TargetLysophosphatidic acid receptor 3
LigandBDBM50177339
Substrate/Competitorn/a
Meas. Tech.ChEMBL_329846 (CHEMBL862795)
IC50 136±n/a nM
Citation Gududuru, VZeng, KTsukahara, RMakarova, NFujiwara, YPigg, KRBaker, DLTigyi, GMiller, DD Identification of Darmstoff analogs as selective agonists and antagonists of lysophosphatidic acid receptors. Bioorg Med Chem Lett16:451-6 (2005) 
 
Lysophosphatidic acid receptor 3
Name:Lysophosphatidic acid receptor 3
Type:PROTEIN
Mol. Mass.:40307.81
Organism:Rattus norvegicus
Description:ChEMBL_329846
Residue:354
BDBM50177339
NameBDBM50177339
Synonyms:CHEMBL436763 | potassium ((2R,4R)-2-(heptadec-9-enyl)-1,3-dioxolan-4-yl)methyl hydrogenphosphate
TypeSmall organic molecule
Emp. Form.C21H40O6P
Mol. Mass.419.513
SMILESCCCCCCC\C=C\CCCCCCCC[C@@H]1OC[C@H](COP(O)([O-])=O)O1