Reaction Details
TargetSubstance-P receptor
LigandBDBM50177381
Substrate/Competitorn/a
Meas. Tech.ChEMBL_334652 (CHEMBL854118)
Ki 93±n/a nM
Citation Shue, HJChen, XSchwerdt, JHPaliwal, SBlythin, DJLin, LGu, DWang, CReichard, GAWang, HPiwinski, JJDuffy, RALachowicz, JECoffin, VLNomeir, AAMorgan, CAVarty, GBShih, NY Cyclic urea derivatives as potent NK1 selective antagonists. Part II: Effects of fluoro and benzylic methyl substitutions. Bioorg Med Chem Lett16:1065-9 (2006) 
 
Substance-P receptor
Name:Substance-P receptor
Type:G Protein-Coupled Receptor (GPCR)
Mol. Mass.:46254.43
Organism:Homo sapiens (Human)
Description:P25103
Residue:407
BDBM50177381
NameBDBM50177381
Synonyms:(R)-4-(((S)-1-(3,5-bis(trifluoromethyl)phenyl)ethoxy)methyl)-4-phenylimidazolidin-2-one | CHEMBL377712
TypeSmall organic molecule
Emp. Form.C20H18F6N2O2
Mol. Mass.432.3595
SMILESC[C@H](OC[C@]1(CNC(=O)N1)c1ccccc1)c1cc(cc(c1)C(F)(F)F)C(F)(F)F