Reaction Details
TargetSubstance-P receptor
LigandBDBM50177385
Substrate/Competitorn/a
Meas. Tech.ChEMBL_334652 (CHEMBL854118)
Ki 0.5±n/a nM
Citation Shue, HJChen, XSchwerdt, JHPaliwal, SBlythin, DJLin, LGu, DWang, CReichard, GAWang, HPiwinski, JJDuffy, RALachowicz, JECoffin, VLNomeir, AAMorgan, CAVarty, GBShih, NY Cyclic urea derivatives as potent NK1 selective antagonists. Part II: Effects of fluoro and benzylic methyl substitutions. Bioorg Med Chem Lett16:1065-9 (2006) 
 
Substance-P receptor
Name:Substance-P receptor
Type:G Protein-Coupled Receptor (GPCR)
Mol. Mass.:46254.43
Organism:Homo sapiens (Human)
Description:P25103
Residue:407
BDBM50177385
NameBDBM50177385
Synonyms:(R)-4-(((R)-1-(3,5-bis(trifluoromethyl)phenyl)ethoxy)methyl)-1-methyl-4-phenylimidazolidin-2-one | CHEMBL380931
TypeSmall organic molecule
Emp. Form.C21H20F6N2O2
Mol. Mass.446.3861
SMILESC[C@@H](OC[C@]1(CN(C)C(=O)N1)c1ccccc1)c1cc(cc(c1)C(F)(F)F)C(F)(F)F