Reaction Details
TargetSubstance-P receptor
LigandBDBM50177384
Substrate/Competitorn/a
Meas. Tech.ChEMBL_334652 (CHEMBL854118)
Ki 1.5±n/a nM
Citation Shue, HJChen, XSchwerdt, JHPaliwal, SBlythin, DJLin, LGu, DWang, CReichard, GAWang, HPiwinski, JJDuffy, RALachowicz, JECoffin, VLNomeir, AAMorgan, CAVarty, GBShih, NY Cyclic urea derivatives as potent NK1 selective antagonists. Part II: Effects of fluoro and benzylic methyl substitutions. Bioorg Med Chem Lett16:1065-9 (2006) 
 
Substance-P receptor
Name:Substance-P receptor
Type:G Protein-Coupled Receptor (GPCR)
Mol. Mass.:46254.43
Organism:Homo sapiens (Human)
Description:P25103
Residue:407
BDBM50177384
NameBDBM50177384
Synonyms:(R)-4-(((R)-1-(3,5-bis(trifluoromethyl)phenyl)ethoxy)methyl)-4-(4-fluorophenyl)imidazolidin-2-one | CHEMBL204554
TypeSmall organic molecule
Emp. Form.C20H17F7N2O2
Mol. Mass.450.35
SMILESC[C@@H](OC[C@]1(CNC(=O)N1)c1ccc(F)cc1)c1cc(cc(c1)C(F)(F)F)C(F)(F)F