Reaction Details
TargetIntegrin alpha-V/beta-6
LigandBDBM50177626
Substrate/Competitorn/a
Meas. Tech.ChEMBL_334211 (CHEMBL866446)
IC50 486±n/a nM
Citation Boys, MLSchretzman, LAChandrakumar, NSTollefson, MBMohler, SBDowns, VLPenning, TDRussell, MAWendt, JAChen, BBStenmark, HGWu, HSpangler, DPClare, MDesai, BNKhanna, IKNguyen, MNDuffin, TEngleman, VWFinn, MBFreeman, SKHanneke, MLKeene, JLKlover, JANickols, GANickols, MASteininger, CNWestlin, MWestlin, WYu, YXWang, YDalton, CRNorring, SA Convergent, parallel synthesis of a series of beta-substituted 1,2,4-oxadiazole butanoic acids as potent and selective alpha(v)beta3 receptor antagonists. Bioorg Med Chem Lett16:839-44 (2006) 
 
Integrin alpha-V/beta-6
Name:Integrin alpha-V/beta-6
Type:Enzyme
Mol. Mass.:n/a
Description:n/a
Components:This complex has 2 components.
Component 1
Name:Integrin alpha-V
Synonyms:ITAV_HUMAN Integrin alpha-V/alpha-5 VNRA Vitronectin receptor | Vitronectin receptor subunit alpha
Type:PROTEIN
Mol. Mass.:116024.92
Organism:Homo sapiens (Human)
Description:ChEMBL_582336
Residue:1048
Component 2
Name:Integrin beta-6
Synonyms:ITB6_HUMAN | ITGB6
Type:PROTEIN
Mol. Mass.:85919.61
Organism:Homo sapiens (Human)
Description:EBI_10916
Residue:788
BDBM50177626
NameBDBM50177626
Synonyms:3-(benzo[d]oxazol-6-yl)-4-(3-(3-(5,6,7,8-tetrahydro-1,8-naphthyridin-2-yl)propyl)-1,2,4-oxadiazol-5-yl)butanoic acid | CHEMBL202295
TypeSmall organic molecule
Emp. Form.C24H25N5O4
Mol. Mass.447.4864
SMILESOC(=O)CC(Cc1nc(CCCc2ccc3CCCNc3n2)no1)c1ccc2ncoc2c1