Reaction Details
TargetIntegrin alpha-V/beta-3
LigandBDBM50177628
Substrate/Competitorn/a
Meas. Tech.ChEMBL_334209 (CHEMBL865264)
IC50 0.65±n/a nM
Citation Boys, MLSchretzman, LAChandrakumar, NSTollefson, MBMohler, SBDowns, VLPenning, TDRussell, MAWendt, JAChen, BBStenmark, HGWu, HSpangler, DPClare, MDesai, BNKhanna, IKNguyen, MNDuffin, TEngleman, VWFinn, MBFreeman, SKHanneke, MLKeene, JLKlover, JANickols, GANickols, MASteininger, CNWestlin, MWestlin, WYu, YXWang, YDalton, CRNorring, SA Convergent, parallel synthesis of a series of beta-substituted 1,2,4-oxadiazole butanoic acids as potent and selective alpha(v)beta3 receptor antagonists. Bioorg Med Chem Lett16:839-44 (2006) 
 
Integrin alpha-V/beta-3
Name:Integrin alpha-V/beta-3
Type:Enzyme
Mol. Mass.:n/a
Description:n/a
Components:This complex has 2 components.
Component 1
Name:Integrin alpha-V
Synonyms:ITAV_HUMAN Integrin alpha-V/alpha-5 VNRA Vitronectin receptor | Vitronectin receptor subunit alpha
Type:PROTEIN
Mol. Mass.:116024.92
Organism:Homo sapiens (Human)
Description:ChEMBL_582336
Residue:1048
Component 2
Name:Integrin beta-3
Synonyms:CD_antigen=CD61 GPIIIa ITGB3 Platelet membrane glycoprotein IIIa
Type:Protein
Mol. Mass.:87038.91
Organism:Homo sapiens (Human)
Description:P05106
Residue:788
BDBM50177628
NameBDBM50177628
Synonyms:(S)-3-(benzo[d][1,3]dioxol-5-yl)-4-(3-(3-(5,6,7,8-tetrahydro-1,8-naphthyridin-2-yl)propyl)-1,2,4-oxadiazol-5-yl)butanoic acid | CHEMBL369981
TypeSmall organic molecule
Emp. Form.C24H26N4O5
Mol. Mass.450.487
SMILESOC(=O)C[C@H](Cc1nc(CCCc2ccc3CCCNc3n2)no1)c1ccc2OCOc2c1